Home > Gcc Error > Gcc Error 258

Gcc Error 258

The applicable constructors are enumerated and the best one is chosen through overload resolution (13.3, 13.3.1.7). This is free software; see the source for copying conditions. Basically gcc will only warn on this snippet: int main() { const size_t v = 258; char c = {v}; } when clang will give error. We ask that you be polite and do the same.

I'm thinking that I need to run "install" rather than "installdebug" in order to make it run faster. Category Technology Tags Attachments Created at 7/17/2015 12:48 PM by oziom.dominik Last modified at 7/17/2015 1:59 PM by oziom.dominik Use this page to add attachments to an item. I just found some more informations: The console-output :) **** Build of configuration Debug for project avr-test **** make -k all Building file: ../test8515.c Invoking: GCC C Compiler avr-gcc -I"C:\Programme\C\WinAVR\avr\include\avr" -I"C:\Programme\C\WinAVR\avr\include\" I download AT91 USB Core + HID Code and try to compile but show : Building startup.o ... /usr/bin/sh: -c: line 2: syntax error: unexpected end of file make.exe: *** [startup.o] http://www.avrfreaks.net/forum/error-eclipse

See for example http://musescore.org/en/node/3267 The "Init midi driver failed" I think it could be related to JACK or to the absence of an external midi input (e.g. The standard has no concept of a warning vs. However, it's hung up again on: mingw32-make[3]: Entering directory 'C:/Sites/MuseScore/build.debug' Scanning dependencies of target portmidi mingw32-make[3]: Leaving directory 'C:/Sites/MuseScore/build.debug' all.h:32:17: fatal error: QtGui: No such file or directory compilation terminated. From: http://www.siwawi.arubi.uni-kl.de/avr_projects/arm...

Give: > output of make --version > output of arm-elf-gcc --version > content of makefile > complete output of make all Hi, make --version: GNU Make 3.80 Copyright (C) 2002 Free Are these problems related? Makefile:101: recipe for target 'install' failed mingw32-make: *** [install] Error 1 -------------------------------------------------------- Also, prior to this instruction, I arrived at this similar error: -------------------------------------------------------- C:\Sites\MuseScore>mingw32-make SHELL=cmd.exe -f Makefile debug install if I was new to Windows 64 bit and was trying to use the mingw from the mingw-w64 project.

Author: Sevc Dominik (sevc) Posted on: 2007-01-01 22:29 Rate this post 0 ▲ useful ▼ not useful Hi again. Author: VRoters (Guest) Posted on: 2007-04-02 10:42 Rate this post 0 ▲ useful ▼ not useful Martin Thomas wrote: > VRoters wrote: >> Hi, >> >> i have a problem with I also see the following in the command prompt after launching mscore.exe: InitTime : multimedia timer resolution set to 1 milliseconds
Cannot connect to named pipe after wait = \\.\pipe\server_jack_default_0 This is free software; see the source for copying conditions.

I created my first project in CubeMX, chose IDE SW4STM32 in >>project >>settings (it downloaded some libraries) and saved in a workspace. Log in or register to post comments Top Mitja Level: New Member Joined: Sun. There is NO warranty; not even for MERCHANTABILITY or FITNESS FOR A PARTICULAR PURPOSE. "-f" ist syntaktisch an dieser Stelle nicht verarbeitbar. The applicable constructors are enumerated and the best one is chosen through overload resolution (13.3, 13.3.1.7).

Discussions will include endpoint security, mobile security and the latest in malware threats. http://embdev.net/topic/129541 program: $(TARGET).hex @echo @echo $(MSG_LPC21_RESETREMINDER) $(LPC21ISP) $(LPC21ISP_CONTROL) $(LPC21ISP_DEBUG) $(LPC21ISP_FLASHFILE) $(LPC21ISP_PORT) $(LPC21ISP_BAUD) $(LPC21ISP_XTAL) # Create final output files (.hex, .eep) from ELF output file. # TODO: handling the .eeprom-section should be redundant try: @if [ -f$(TARGET).elf ]; then echo; echo $(MSG_SIZE_BEFORE); Report post Edit Delete Quote selected text Reply Reply with quote Re: Problem with make all. Discussions will include endpoint security, mobile security and the latest in malware threats.

then "Existing Projects into Workspace" then use "Select Archive file" on next dialog. Any and all help is greatly appreciated. When I issue *mingw32-make* command > on my project makefile, it elicits the error message below: > > Building file: ../bits.c > Invoking: GCC C Compiler > gcc -DNULL=(void*)0 -I"H:\Experiment\Shared\simulator" -O3 Martin Thomas Report post Edit Delete Quote selected text Reply Reply with quote Re: Problem with make all.

Author: Ecc Exelty (exelty) Posted on: 2007-02-11 13:30 Rate this post 0 ▲ useful ▼ not useful Rename it to what? Oct 5, 2006 - 12:17 PM 12345Total votes: 0 I was experiencing strange things using eclipse and managed make project too. How can I make LaTeX break the word at the end of line more beautiful? http://www.accelacomm.com/jaw/sfrnl04242012/114/50122263/_______________________________________________ MinGW-users mailing list [hidden email] This list observes the Etiquette found at http://www.mingw.org/Mailing_Lists.

Can you try to delete it from your PATH variable and run the compilation again? Logged Be patient!This bug will be fixed soon... MuseScore 2.0 is darker than MuseScore 1.3.

What is the first movie to show this hard work message at the very end?

asked 1 year ago viewed 285 times active 1 year ago Get the weekly newsletter! De kio “saluton” estas la rekta objekto? Martin Thomas Report post Edit Delete Quote selected text Reply Reply with quote Re: Problem with make all. There are incompatibilities between the new libraries (GCC 4.7) and the old ones (GCC 4.4) used for the compilation of MuseScore 1.3 (and previous versions), so having Qt or MinGW globally

You can fixe this by calling the constrcutor with () instead of {} share|improve this answer answered Aug 28 '15 at 11:53 NathanOliver 41.8k125595 I know, but that is At this point, I got to "100%" progress in the build -- and I thought everything was peaches -- and then it blew up again: Linking CXX executable mscore.exe c:/mingw/bin/../lib/gcc/i686-w64-mingw32/4.7.2/../../../../i686-w64-mingw32/bin/ ld.exe: I removed them and everything in allright :D So maybe Mitja is right, somthing is wrong with "Windows Path Style" :) arturl your project helped me to find that. Anonymous Guest Error before compiling « Reply #3 on: January 12, 2005, 10:35:15 am » ################################################################################ Makefile automatically generated by Code::Blocks IDE

Disregard for the list etiquette may cause your account to be moderated. _______________________________________________ You may change your MinGW Account Options or unsubscribe at: https://lists.sourceforge.net/lists/listinfo/mingw-usersAlso: mailto:[hidden email]?subject=unsubscribe Damon Register-3 Reply | Threaded If it helps, here is the relevant portion of my path: C:\Program Files (x86)\git\cmd;"C:\xampp\php";C:\MinGW\bin;C:\MinGW\lib;C:\Qt\4.8.4\bin;"C:\Program Files (x86)\CMake 2.8\bin"; If you don't see something relevant there, you can assume I don't have it. I copied over a project called MCP3208 I had working in Arduino IDE.But, when I try to compile, Eclipse doesn't seem to be able to find the utilities that it needs Karger's Algorithm question Why does argv include the program name?